BDBM50394218 CHEMBL2159156
SMILES CCCS(=O)(=O)c1ccc2nc([nH]c2c1)N1CCOC(C1)c1ccccc1
InChI Key InChIKey=TXEXIUFCFKEHNJ-UHFFFAOYSA-N
Data  1 IC50
  Tab Delimited (TSV)   2D SDfile   Computed 3D by Vconf -m prep SDfile
Find this compound or compounds like it in BindingDB:
Activity Spreadsheet -- Enzyme Inhibition Constant Data from BindingDB
Found 1 hit for monomerid = 50394218
TargetNeuropeptide Y receptor type 5(Mus musculus (Mouse))
Shionogi
Curated by ChEMBL
LigandPNGBDBM50394218(CHEMBL2159156)
Affinity DataIC50:  0.600nM. Assay description: Displacement of [125I]PYY from mouse NPY Y5 receptor
In DepthDetails ArticlePubMed