BDBM50395781 CHEMBL2164854
SMILES CN(C)CCn1cc(cc(NC(=O)[C@H](Cc2ccccc2)NC2(CC2)c2ccccn2)c1=O)-c1ccncc1
InChI Key InChIKey=CFUQJRQSRBNLSO-SANMLTNESA-N
Data  1 EC50
  Tab Delimited (TSV)   2D SDfile   Computed 3D by Vconf -m prep SDfile
Find this compound or compounds like it in BindingDB:
Activity Spreadsheet -- Enzyme Inhibition Constant Data from BindingDB
Found 1 hit for monomerid = 50395781
TargetProbable G-protein coupled receptor 142(Homo sapiens (Human))
Amgen
Curated by ChEMBL
LigandPNGBDBM50395781(CHEMBL2164854)
Affinity DataEC50:  280nM. Assay description: Agonist activity at human GPR142 expressed in HEK293 cells assessed as inositol phosphate accumulation after 1 hr by scintillation counting
In DepthDetails ArticlePubMed