BDBM50395793 CHEMBL2164841
SMILES O=C(Nc1cc(c[nH]c1=O)-c1ccncc1)[C@H](Cc1ccccc1)NCCc1ccccn1
InChI Key InChIKey=DWRDAUZMBBZNJN-QHCPKHFHSA-N
Data  1 EC50
  Tab Delimited (TSV)   2D SDfile   Computed 3D by Vconf -m prep SDfile
Find this compound or compounds like it in BindingDB:
Activity Spreadsheet -- Enzyme Inhibition Constant Data from BindingDB
Found 1 hit for monomerid = 50395793
TargetProbable G-protein coupled receptor 142(Homo sapiens (Human))
Amgen
Curated by ChEMBL
LigandPNGBDBM50395793(CHEMBL2164841)
Affinity DataEC50:  1.32E+3nM. Assay description: Agonist activity at human GPR142 expressed in HEK293 cells assessed as inositol phosphate accumulation after 1 hr by scintillation counting
In DepthDetails ArticlePubMed