BDBM50398116 CHEMBL2182037
SMILES C[C@@H](OC(=O)Nc1c(C)nnn1-c1ccc(cc1)-c1ccc(cc1)C1(CC1)C(=O)NS(C)(=O)=O)c1ccccc1
InChI Key InChIKey=FJLBJDCQCPHBIU-HXUWFJFHSA-N
Data  1 IC50
  Tab Delimited (TSV)   2D SDfile   Computed 3D by Vconf -m prep SDfile
Find this compound or compounds like it in BindingDB:
Activity Spreadsheet -- Enzyme Inhibition Constant Data from BindingDB
Found 1 hit for monomerid = 50398116
TargetLysophosphatidic acid receptor 1(Homo sapiens (Human))
F. Hoffmann-La Roche
Curated by ChEMBL
LigandPNGBDBM50398116(CHEMBL2182037)
Affinity DataIC50:  32nM. Assay description: Antagonist activity at human recombinant LPA1 expressed in chem-1 cells assessed as inhibition of LPA-induced intracellular calcium mobilization incu...
In DepthDetails ArticlePubMed