BDBM50402806 CHEMBL2208426
SMILES CS(=O)(=O)c1ccc(s1)C(=O)NC[C@@H](O)CN1CCC(CC1)Oc1ccc(Cl)c(Cl)c1
InChI Key InChIKey=AJUWTQZJBKWQNV-CYBMUJFWSA-N
Data  2 KI
  Tab Delimited (TSV)   2D SDfile   Computed 3D by Vconf -m prep SDfile
Find this compound or compounds like it in BindingDB:
Activity Spreadsheet -- Enzyme Inhibition Constant Data from BindingDB
Found 2 hits for monomerid = 50402806
TargetHistamine H1 receptor(Homo sapiens (Human))
Astrazeneca
Curated by ChEMBL
LigandPNGBDBM50402806(CHEMBL2208426)
Affinity DataKi:  100nM. Assay description: Displacement of [3H]-pyrilamine from human histamine H1 receptor expressed in recombinant CHOK1 cells after 1 hr
In DepthDetails ArticlePubMed
TargetC-C chemokine receptor type 3(Homo sapiens (Human))
Astrazeneca
Curated by ChEMBL
LigandPNGBDBM50402806(CHEMBL2208426)
Affinity DataKi:  251nM. Assay description: Displacement of [3H]-4-(2,4-dichloro-3-methylphenoxy)-l'-[4- (methylsulfonyl)benzoyl]-l,4'-bipiperidine from human recombinant CCR3 expressed in CHOK...
In DepthDetails ArticlePubMed