BDBM50403918 CHEMBL2113739
SMILES CN(C(=O)c1cc(cc(c1)C(F)(F)F)C(F)(F)F)c1cc(ccc1-c1ccc(F)cc1)C(=O)N[C@@H]1CCCCNC1=O
InChI Key InChIKey=AZDSYYOXSFTNRY-HSZRJFAPSA-N
Data  2 IC50
  Tab Delimited (TSV)   2D SDfile   Computed 3D by Vconf -m prep SDfile
Find this compound or compounds like it in BindingDB:
Activity Spreadsheet -- Enzyme Inhibition Constant Data from BindingDB
Found 2 hits for monomerid = 50403918
TargetSubstance-K receptor(Homo sapiens (Human))
Novartis Pharma
Curated by ChEMBL
LigandPNGBDBM50403918(CHEMBL2113739)
Affinity DataIC50:  28nM. Assay description: Binding affinity of the compound was determined by measuring the inhibition of 125 I-NKA binding to transfected CHO-cells expressing human recombinan...
In DepthDetails ArticlePubMed
TargetSubstance-P receptor(Homo sapiens (Human))
Novartis Pharma
Curated by ChEMBL
LigandPNGBDBM50403918(CHEMBL2113739)
Affinity DataIC50:  1nM. Assay description: inhibition of [3H]-Sar-SP binding to Tachykinin receptor 1 of bovine retina membranes
In DepthDetails ArticlePubMed