BDBM50406920 CHEMBL78953
SMILES C[C@@H](N)C(=O)N[C@@H](Cc1ccccc1)C(O)=O
InChI Key InChIKey=OMNVYXHOSHNURL-SCZZXKLOSA-N
Data  2 IC50
  Tab Delimited (TSV)   2D SDfile   Computed 3D by Vconf -m prep SDfile
Find this compound or compounds like it in BindingDB:
Activity Spreadsheet -- Enzyme Inhibition Constant Data from BindingDB
Found 2 hits for monomerid = 50406920
TargetAngiotensin-converting enzyme(Homo sapiens (Human))
Washington University
Curated by ChEMBL
LigandPNGBDBM50406920(CHEMBL78953)
Affinity DataIC50:  1.91E+5nM. Assay description: Inhibitory activity against angiotensin converting enzyme (ACE)
In DepthDetails ArticlePubMed
TargetAngiotensin-converting enzyme(Homo sapiens (Human))
Washington University
Curated by ChEMBL
LigandPNGBDBM50406920(CHEMBL78953)
Affinity DataIC50:  1.90E+5nM. Assay description: Inhibitory activity against angiotensin converting enzyme (ACE)
In DepthDetails ArticlePubMed