BDBM50407239 CHEMBL5275894
SMILES CC(C)C[C@@H]1CN[C@@H](CC(O)=O)C(=O)N[C@H](CCC(N)=O)C(=O)N[C@@H](Cc2c[nH]c3ccccc23)C(=O)N[C@H](Cc2ccccc2)C(=O)NCCC(=O)N1
InChI Key InChIKey=HWXOTFKHHKEHFJ-GQZMCTKHSA-N
Data  2 IC50
  Tab Delimited (TSV)   2D SDfile   Computed 3D by Vconf -m prep SDfile
Find this compound or compounds like it in BindingDB:
Activity Spreadsheet -- Enzyme Inhibition Constant Data from BindingDB
Found 2 hits for monomerid = 50407239
TargetKelch-like ECH-associated protein 1(Homo sapiens (Human))TBA
LigandPNGBDBM50407239(CHEMBL5275894)
Affinity DataIC50:  97nM. Assay description: Negative log concentration of antagonist on 5-hydroxytryptamine 2A receptor in rat thoracic aorta
In DepthDetails PubMed
TargetMatrix metalloproteinase-9(Homo sapiens (Human))TBA
LigandPNGBDBM50407239(CHEMBL5275894)
Affinity DataIC50: >1.00E+6nM. Assay description: Negative log concentration of antagonist on 5-hydroxytryptamine 2A receptor in rat thoracic aorta
In DepthDetails PubMed