BDBM50407352 CHEMBL300209
SMILES CN(C)CCc1c[nH]c2ccc(Cc3nnn[nH]3)cc12
InChI Key InChIKey=LMSNSIQAWQSERP-UHFFFAOYSA-N
Data  5 IC50
  Tab Delimited (TSV)   2D SDfile   Computed 3D by Vconf -m prep SDfile
Find this compound or compounds like it in BindingDB:
Activity Spreadsheet -- Enzyme Inhibition Constant Data from BindingDB
Found 5 hits for monomerid = 50407352
Target5-hydroxytryptamine receptor 3A/3B(Rattus norvegicus)
Merck Sharp & Dohme Research Laboratories
Curated by ChEMBL
LigandPNGBDBM50407352(CHEMBL300209)
Affinity DataIC50: >1.00E+4nM. Assay description: Binding activity against 5-hydroxytryptamine 2A receptor from rat cortex homogenates using [3H]DOB as radioligand.
In DepthDetails ArticlePubMed
Target5-hydroxytryptamine receptor 1D(Sus scrofa)
Merck Sharp & Dohme Research Laboratories
Curated by ChEMBL
LigandPNGBDBM50407352(CHEMBL300209)
Affinity DataIC50:  3.98E+3nM. Assay description: Binding activity against 5-hydroxytryptamine 3 receptor from rat cortex homogenate using [3H]-Q-ICS 205-930 as radioligand.
In DepthDetails ArticlePubMed
Target5-hydroxytryptamine receptor 1A(Homo sapiens (Human))
Merck Sharp & Dohme Research Laboratories
Curated by ChEMBL
LigandPNGBDBM50407352(CHEMBL300209)
Affinity DataIC50:  63.1nM. Assay description: Binding activity against 5-hydroxytryptamine 1A receptor from pig cortex membrane using [3H]8-OH-DPAT-HT as radioligand.
In DepthDetails ArticlePubMed
Target5-hydroxytryptamine receptor 2C(Homo sapiens (Human))
Merck Sharp & Dohme Research Laboratories
Curated by ChEMBL
LigandPNGBDBM50407352(CHEMBL300209)
Affinity DataIC50: >1.00E+4nM. Assay description: Binding activity against 5-hydroxytryptamine 2C receptor from pig cortex membrane using [3H]mesulergine as radioligand.
In DepthDetails ArticlePubMed
Target5-hydroxytryptamine receptor 2A(Rattus norvegicus (rat))
Merck Sharp & Dohme Research Laboratories
Curated by ChEMBL
LigandPNGBDBM50407352(CHEMBL300209)
Affinity DataIC50: >1.00E+4nM. Assay description: Binding activity against 5-hydroxytryptamine 2C receptor from pig cortex membrane using [3H]mesulergine as radioligand.
In DepthDetails ArticlePubMed