BDBM50407440 CHEMBL5286517
SMILES CC(C)[C@H](NC(=O)[C@@H](Cc1c[nH]c2ccccc12)NC(=O)[C@H](Cc1ccc(O)cc1)NC(=O)[C@@H](N)CC(O)=O)C(=O)N[C@H](Cc1c[nH]c2ccccc12)C(=O)N[C@H](Cc1c[nH]c2ccccc12)C(=O)N[C@H](Cc1c[nH]c2ccccc12)C(O)=O
InChI Key InChIKey=IFEQRVFNHZESHM-IHDKKPDCSA-N
Data  2 IC50
  Tab Delimited (TSV)   2D SDfile   Computed 3D by Vconf -m prep SDfile
Find this compound or compounds like it in BindingDB:
Activity Spreadsheet -- Enzyme Inhibition Constant Data from BindingDB
Found 2 hits for monomerid = 50407440
TargetCholinesterase(Homo sapiens (Human))TBA
LigandPNGBDBM50407440(CHEMBL5286517)
Affinity DataIC50:  2.24E+3nM. Assay description: Antagonistic affinity tested against isolated Rat Prostatic Vas Deferens Alpha-1A adrenergic receptor
In DepthDetails PubMed
TargetAcetylcholinesterase(Homo sapiens (Human))TBA
LigandPNGBDBM50407440(CHEMBL5286517)
Affinity DataIC50:  1.42E+4nM. Assay description: Antagonistic affinity tested against isolated Rat Prostate Alpha-1A adrenergic receptor
In DepthDetails PubMed