BDBM50412558 CHEMBL464081
SMILES CC1(C)[C@@H]2CC[C@@]1(CS(=O)(=O)N1CCN(CC1)c1ccc(cn1)C(F)(F)F)C(=O)C2
InChI Key InChIKey=BYVPYJYHCMIHMK-AUUYWEPGSA-N
Data  2 IC50
  Tab Delimited (TSV)   2D SDfile   Computed 3D by Vconf -m prep SDfile
Find this compound or compounds like it in BindingDB:
Activity Spreadsheet -- Enzyme Inhibition Constant Data from BindingDB
Found 2 hits for monomerid = 50412558
TargetC-X-C chemokine receptor type 3(Homo sapiens (Human))
Glaxosmithkline
Curated by ChEMBL
LigandPNGBDBM50412558(CHEMBL464081)
Affinity DataIC50:  251nM. Assay description: Antagonist activity at human recombinant CXCR3 receptor expressed in CHO-K1 cells assessed as human IP10-induced calcium flux by FLIPR assay
In DepthDetails ArticlePubMed
TargetC-X-C chemokine receptor type 3(Mus musculus)
Glaxosmithkline
Curated by ChEMBL
LigandPNGBDBM50412558(CHEMBL464081)
Affinity DataIC50:  1.26E+3nM. Assay description: Antagonist activity at mouse recombinant CXCR3 expressed in human U2OS cells
In DepthDetails ArticlePubMed