BDBM50412976 CHEMBL480037
SMILES Cc1ccc(o1)-c1ccc(cc1F)S(=O)(=O)N1C[C@H](O)C[C@H]1C(=O)N1CC[C@@H](N)C1
InChI Key InChIKey=AVJHHZKCFDWAHM-LBTNJELSSA-N
Data  1 EC50
  Tab Delimited (TSV)   2D SDfile   Computed 3D by Vconf -m prep SDfile
Find this compound or compounds like it in BindingDB:
Activity Spreadsheet -- Enzyme Inhibition Constant Data from BindingDB
Found 1 hit for monomerid = 50412976
TargetGrowth hormone secretagogue receptor type 1(Homo sapiens (Human))
Glaxosmithkline
Curated by ChEMBL
LigandPNGBDBM50412976(CHEMBL480037)
Affinity DataEC50:  0.501nM. Assay description: Agonist activity at human ghrelin receptor by cell based BACMAM FLIPR assay
In DepthDetails ArticlePubMed