BDBM50413034 CHEMBL495919
SMILES CCCCNc1nccc2n(Cc3ccccc3)c3ccccc3c12
InChI Key InChIKey=AXGIMQBWBFNSFJ-UHFFFAOYSA-N
Data  1 KI
  Tab Delimited (TSV)   2D SDfile   Computed 3D by Vconf -m prep SDfile
Find this compound or compounds like it in BindingDB:
Activity Spreadsheet -- Enzyme Inhibition Constant Data from BindingDB
Found 1 hit for monomerid = 50413034
TargetUrotensin-2 receptor(Homo sapiens (Human))
Glaxosmithkline
Curated by ChEMBL
LigandPNGBDBM50413034(CHEMBL495919)
Affinity DataKi:  3.98E+3nM. Assay description: Displacement of [125I]human urotensin 2 from human recombinant urotensin 2 receptor expressed in HEK293 cells
In DepthDetails ArticlePubMed