BDBM50416509 CHEMBL1214256::US9321743, URB783
SMILES O=C(CCc1ccccc1)N[C@H]1COC1=O
InChI Key InChIKey=UUEMOTWYJKOUPP-JTQLQIEISA-N
Data  4 IC50
  Tab Delimited (TSV)   2D SDfile   Computed 3D by Vconf -m prep SDfile
Find this compound or compounds like it in BindingDB:
Activity Spreadsheet -- Enzyme Inhibition Constant Data from BindingDB
Found 4 hits for monomerid = 50416509
TargetN-acylethanolamine-hydrolyzing acid amidase(Rattus norvegicus (Rat))
University Of California
US Patent
LigandPNGBDBM50416509(CHEMBL1214256 | US9321743, URB783)
Affinity DataIC50:  420nMpH: 5.0 T: 2°C. Assay description: Recombinant NAAA or native rat lung NAAA was incubated at 37 °C. for 30 min in 0.2 ml of sodium hydrogen phosphate buffer (50 mM, pH 5.0) contain...
In DepthDetails US Patent
TargetN-acylethanolamine-hydrolyzing acid amidase(Rattus norvegicus (Rat))
University Of California
US Patent
LigandPNGBDBM50416509(CHEMBL1214256 | US9321743, URB783)
Affinity DataIC50:  420nM. Assay description: Inhibition of rat NAAA
In DepthDetails ArticlePubMed
TargetN-acylethanolamine-hydrolyzing acid amidase(Rattus norvegicus (Rat))
University Of California
US Patent
LigandPNGBDBM50416509(CHEMBL1214256 | US9321743, URB783)
Affinity DataIC50:  420nM. Assay description: Inhibition of rat recombinant NAAA expressed in HEK293 cells after 30 mins
In DepthDetails ArticlePubMed
TargetN-acylethanolamine-hydrolyzing acid amidase(Rattus norvegicus (Rat))
University Of California
US Patent
LigandPNGBDBM50416509(CHEMBL1214256 | US9321743, URB783)
Affinity DataIC50:  420nM. Assay description: Inhibition of recombinant rat lung NAAA enzyme using heptadecenoylethanolamide as substrate by LC/MS analysis
In DepthDetails ArticlePubMed