BDBM50419882 CHEMBL1956200
SMILES CC(Oc1ccccc1S(C)(=O)=O)C1=NCCN1
InChI Key InChIKey=BUVSDNNKXQXCRO-UHFFFAOYSA-N
Data  3 KI  3 EC50
  Tab Delimited (TSV)   2D SDfile   Computed 3D by Vconf -m prep SDfile
Find this compound or compounds like it in BindingDB:
Activity Spreadsheet -- Enzyme Inhibition Constant Data from BindingDB
Found 6 hits for monomerid = 50419882
TargetAlpha-2A adrenergic receptor(Homo sapiens (Human))
Universit£
Curated by ChEMBL
LigandPNGBDBM50419882(CHEMBL1956200)
Affinity DataKi:  3.16E+3nM. Assay description: Displacement of [3H]RS-79948-197 from human adrenoceptor aplha 2A expressed in CHO cells
In DepthDetails ArticlePubMed
TargetAlpha-2C adrenergic receptor(Homo sapiens (Human))
Universit£
Curated by ChEMBL
LigandPNGBDBM50419882(CHEMBL1956200)
Affinity DataKi:  3.80E+3nM. Assay description: Displacement of [3H]RS-79948-197 from human adrenoceptor aplha 2C expressed in CHO cells
In DepthDetails ArticlePubMed
TargetAlpha-2B adrenergic receptor(Homo sapiens (Human))
Universit£
Curated by ChEMBL
LigandPNGBDBM50419882(CHEMBL1956200)
Affinity DataKi:  5.13E+4nM. Assay description: Displacement of [3H]RS-79948-197 from human adrenoceptor aplha 2B expressed in CHO cells
In DepthDetails ArticlePubMed
TargetAlpha-2A adrenergic receptor(Homo sapiens (Human))
Universit£
Curated by ChEMBL
LigandPNGBDBM50419882(CHEMBL1956200)
Affinity DataEC50:  562nM. Assay description: Agonist activity at human adrenoceptor aplha 2A expressed in CHO cells assessed as rate of extracellular acidification by cytosensor microphysiometri...
In DepthDetails ArticlePubMed
TargetAlpha-2B adrenergic receptor(Homo sapiens (Human))
Universit£
Curated by ChEMBL
LigandPNGBDBM50419882(CHEMBL1956200)
Affinity DataEC50:  1.00E+4nM. Assay description: Agonist activity at human adrenoceptor aplha 2B expressed in CHO cells assessed as rate of extracellular acidification by cytosensor microphysiometri...
In DepthDetails ArticlePubMed
TargetAlpha-2C adrenergic receptor(Homo sapiens (Human))
Universit£
Curated by ChEMBL
LigandPNGBDBM50419882(CHEMBL1956200)
Affinity DataEC50:  316nM. Assay description: Agonist activity at human adrenoceptor aplha 2C expressed in CHO cells assessed as rate of extracellular acidification by cytosensor microphysiometri...
In DepthDetails ArticlePubMed