BDBM50420850 CHEMBL2086675
SMILES CC(C)(C)OC(=O)N1CCN(CC1)c1ncc(OCc2ccncc2)cn1
InChI Key InChIKey=GYLVPMDDUCFZCW-UHFFFAOYSA-N
Data  2 EC50
  Tab Delimited (TSV)   2D SDfile   Computed 3D by Vconf -m prep SDfile
Find this compound or compounds like it in BindingDB:
Activity Spreadsheet -- Enzyme Inhibition Constant Data from BindingDB
Found 2 hits for monomerid = 50420850
TargetGlucose-dependent insulinotropic receptor(Mus musculus)
Astrazeneca
Curated by ChEMBL
LigandPNGBDBM50420850(CHEMBL2086675)
Affinity DataEC50:  719nM. Assay description: Agonist activity at mouse GPR119 receptor assessed as increase in cAMP level after 45 mins by HTRF assay
In DepthDetails ArticlePubMed
TargetGlucose-dependent insulinotropic receptor(Homo sapiens (Human))
Astrazeneca
Curated by ChEMBL
LigandPNGBDBM50420850(CHEMBL2086675)
Affinity DataEC50:  621nM. Assay description: Agonist activity at human GPR119 receptor over expressed in HEK293S cells assessed as increase in cAMP level after 45 mins by HTRF assay
In DepthDetails ArticlePubMed