BDBM50422139 CHEMBL2304010
SMILES CSC(C)(C)[C@@H]1NC(=O)[C@@H]2CCCN2C(=O)[C@@H](CC(O)=O)NC(=O)[C@H](Cc2c(Cl)[nH]c3ccccc23)NC(=O)[C@H](NC1=O)C(C)C
InChI Key InChIKey=HPPWWHKGYGQMCU-OJKLRCKNSA-N
Data  2 IC50
  Tab Delimited (TSV)   2D SDfile   Computed 3D by Vconf -m prep SDfile
Find this compound or compounds like it in BindingDB:
Activity Spreadsheet -- Enzyme Inhibition Constant Data from BindingDB
Found 2 hits for monomerid = 50422139
TargetEndothelin receptor type B(Sus scrofa)
Tsukuba Research Institute
Curated by ChEMBL
LigandPNGBDBM50422139(CHEMBL2304010)
Affinity DataIC50:  11nM. Assay description: Binding affinity towards endothelin B receptor in porcine cerebellum membranes
In DepthDetails ArticlePubMed
TargetEndothelin-1 receptor(Sus scrofa)
Tsukuba Research Institute
Curated by ChEMBL
LigandPNGBDBM50422139(CHEMBL2304010)
Affinity DataIC50:  100nM. Assay description: Binding affinity towards endothelin A receptor in porcine aortic smooth muscle membranes.
In DepthDetails ArticlePubMed