BDBM50422844 CHEMBL440944
SMILES CN1CCN(CC1)C1C[C@@H](Oc2ccc(Cl)cc2)c2c(C1=O)c1ccccc1n2C
InChI Key InChIKey=BUBAWRGTUJWAJK-BPGUCPLFSA-N
Data  1 IC50
  Tab Delimited (TSV)   2D SDfile   Computed 3D by Vconf -m prep SDfile
Find this compound or compounds like it in BindingDB:
Activity Spreadsheet -- Enzyme Inhibition Constant Data from BindingDB
Found 1 hit for monomerid = 50422844
TargetNeuropeptide Y receptor type 1(Homo sapiens (Human))
Glaxosmithkline
Curated by ChEMBL
LigandPNGBDBM50422844(CHEMBL440944)
Affinity DataIC50:  2.51E+4nM. Assay description: Displacement of [125I]PYY from human recombinant NPY1 receptor expressed in CHO cells
In DepthDetails ArticlePubMed