BDBM50423317 CHEMBL440236
SMILES CN1C[C@@H](C[C@@H]2Cc3c(C[C@@H]12)cccc3OS(C)(=O)=O)C(=O)N1CCN(CC1)c1ccc(cc1)[N+]([O-])=O
InChI Key InChIKey=IUODROSXFMPOIL-YOSAUDMPSA-N
Data  2 Kd
  Tab Delimited (TSV)   2D SDfile   Computed 3D by Vconf -m prep SDfile
Find this compound or compounds like it in BindingDB:
Activity Spreadsheet -- Enzyme Inhibition Constant Data from BindingDB
Found 2 hits for monomerid = 50423317
TargetSomatostatin receptor type 2(RAT)
Novartis Institutes For Biomedical Research
Curated by ChEMBL
LigandPNGBDBM50423317(CHEMBL440236)
Affinity DataKd:  3.72E+3nM. Assay description: Displacement of [125I]SRIF14 from sst2 receptor in rat brain cortex membrane
In DepthDetails ArticlePubMed
TargetSomatostatin receptor type 1(RAT)
Novartis Institutes For Biomedical Research
Curated by ChEMBL
LigandPNGBDBM50423317(CHEMBL440236)
Affinity DataKd:  0.407nM. Assay description: Displacement of [125I]SRIF14 from sst1 receptor in rat brain cortex membrane
In DepthDetails ArticlePubMed