BDBM50423331 CHEMBL250724
SMILES COc1cccc2C[C@@H]3[C@H](C[C@H](CN3C)C(=O)N3CCN(CC3)c3ccc4ccccc4n3)Cc12
InChI Key InChIKey=LVHUMTFXKYMKOO-JQYIIUTOSA-N
Data  2 Kd
  Tab Delimited (TSV)   2D SDfile   Computed 3D by Vconf -m prep SDfile
Find this compound or compounds like it in BindingDB:
Activity Spreadsheet -- Enzyme Inhibition Constant Data from BindingDB
Found 2 hits for monomerid = 50423331
TargetSomatostatin receptor type 1(RAT)
Novartis Institutes For Biomedical Research
Curated by ChEMBL
LigandPNGBDBM50423331(CHEMBL250724)
Affinity DataKd:  28nM. Assay description: Displacement of [125I]SRIF14 from rat sst1 receptor from rat brain cortex membrane
In DepthDetails ArticlePubMed
TargetSomatostatin receptor type 2(RAT)
Novartis Institutes For Biomedical Research
Curated by ChEMBL
LigandPNGBDBM50423331(CHEMBL250724)
Affinity DataKd:  2.09E+3nM. Assay description: Displacement of [125I]SRIF14 from rat sst2 receptor from rat brain cortex membrane
In DepthDetails ArticlePubMed