BDBM50423458 CHEMBL252232
SMILES CN1C[C@H](C[C@@H]2[C@@H]1Cc1c(Br)[nH]c3cccc2c13)C(=O)N1CCN(CC1)c1ccc2nonc2c1
InChI Key InChIKey=GZFMZJDVLOZLLL-WIRVKHDMSA-N
Data  7 Kd
  Tab Delimited (TSV)   2D SDfile   Computed 3D by Vconf -m prep SDfile
Find this compound or compounds like it in BindingDB:
Activity Spreadsheet -- Enzyme Inhibition Constant Data from BindingDB
Found 7 hits for monomerid = 50423458
TargetSomatostatin receptor type 1(RAT)
Novartis Institutes For Biomedical Research
Curated by ChEMBL
LigandPNGBDBM50423458(CHEMBL252232)
Affinity DataKd:  182nM. Assay description: Displacement of [125I]SRIF14 from sst1 receptor in rat cortex
In DepthDetails ArticlePubMed
TargetSomatostatin receptor type 3(Homo sapiens (Human))
Novartis Institutes For Biomedical Research
Curated by ChEMBL
LigandPNGBDBM50423458(CHEMBL252232)
Affinity DataKd:  7.24E+3nM. Assay description: Binding affinity to human recombinant sst3 receptor
In DepthDetails ArticlePubMed
TargetSomatostatin receptor type 4(Homo sapiens (Human))
Novartis Institutes For Biomedical Research
Curated by ChEMBL
LigandPNGBDBM50423458(CHEMBL252232)
Affinity DataKd:  5.62E+3nM. Assay description: Binding affinity to human recombinant sst4 receptor
In DepthDetails ArticlePubMed
TargetSomatostatin receptor type 5(Homo sapiens (Human))
Novartis Institutes For Biomedical Research
Curated by ChEMBL
LigandPNGBDBM50423458(CHEMBL252232)
Affinity DataKd:  2.34E+4nM. Assay description: Binding affinity to human recombinant sst5 receptor
In DepthDetails ArticlePubMed
TargetSomatostatin receptor type 2(Homo sapiens (Human))
Novartis Institutes For Biomedical Research
Curated by ChEMBL
LigandPNGBDBM50423458(CHEMBL252232)
Affinity DataKd:  3.89E+3nM. Assay description: Binding affinity to human recombinant sst2 receptor
In DepthDetails ArticlePubMed
TargetSomatostatin receptor type 2(RAT)
Novartis Institutes For Biomedical Research
Curated by ChEMBL
LigandPNGBDBM50423458(CHEMBL252232)
Affinity DataKd:  1.26E+4nM. Assay description: Displacement of [125I][Tyr3]octreotide from sst2 receptor in rat cortex
In DepthDetails ArticlePubMed
TargetSomatostatin receptor type 1(Homo sapiens (Human))
Novartis Institutes For Biomedical Research
Curated by ChEMBL
LigandPNGBDBM50423458(CHEMBL252232)
Affinity DataKd:  501nM. Assay description: Binding affinity to human recombinant sst1 receptor
In DepthDetails ArticlePubMed