BDBM50424382 CHEMBL2315057
SMILES Cc1ccc(cc1)S(=O)(=O)NC(=O)c1cccc(Cc2cc(Cl)ccc2OCc2ccc(Cl)cc2F)n1
InChI Key InChIKey=NVPDIBBYSPFSSM-UHFFFAOYSA-N
Data  1 Kd
  Tab Delimited (TSV)   2D SDfile   Computed 3D by Vconf -m prep SDfile
Find this compound or compounds like it in BindingDB:
Activity Spreadsheet -- Enzyme Inhibition Constant Data from BindingDB
Found 1 hit for monomerid = 50424382
TargetProstaglandin E2 receptor EP1 subtype(Mus musculus (Mouse))
Vanderbilt University School Of Medicine
Curated by ChEMBL
LigandPNGBDBM50424382(CHEMBL2315057)
Affinity DataKd:  214nM. Assay description: Antagonist activity at mouse EP1 receptor expressed in CHOK1 cells assessed as inhibition of 17PTPGE2-induced calcium influx
In DepthDetails ArticlePubMed