BDBM50424391 CHEMBL2315048
SMILES Fc1cc(Cl)ccc1COc1ccc(Cl)cc1Cc1cccc(n1)C(=O)NC1CCC1
InChI Key InChIKey=YRORDIALXSEBNJ-UHFFFAOYSA-N
Data  1 Kd
  Tab Delimited (TSV)   2D SDfile   Computed 3D by Vconf -m prep SDfile
Find this compound or compounds like it in BindingDB:
Activity Spreadsheet -- Enzyme Inhibition Constant Data from BindingDB
Found 1 hit for monomerid = 50424391
TargetProstaglandin E2 receptor EP1 subtype(Mus musculus (Mouse))
Vanderbilt University School Of Medicine
Curated by ChEMBL
LigandPNGBDBM50424391(CHEMBL2315048)
Affinity DataKd:  912nM. Assay description: Antagonist activity at mouse EP1 receptor expressed in CHOK1 cells assessed as inhibition of 17PTPGE2-induced calcium influx
In DepthDetails ArticlePubMed