BDBM50427885 CHEMBL2324612
SMILES CN1CCN(CC1)C(=O)CCCCC1CCSS1
InChI Key InChIKey=MIJCTWTXANYVCB-UHFFFAOYSA-N
Data  1 KI
  Tab Delimited (TSV)   2D SDfile   Computed 3D by Vconf -m prep SDfile
Find this compound or compounds like it in BindingDB:
Activity Spreadsheet -- Enzyme Inhibition Constant Data from BindingDB
Found 1 hit for monomerid = 50427885
TargetSigma non-opioid intracellular receptor 1(Cavia porcellus (Guinea pig))
University Of Catania
Curated by ChEMBL
LigandPNGBDBM50427885(CHEMBL2324612)
Affinity DataKi:  1.15E+5nM. Assay description: Displacement of [3H]-(+)-pentazocine from sigma1 receptor in guinea pig brain membrane after 150 mins by liquid scintillation counting analysis
In DepthDetails ArticlePubMed