BDBM50434304 CHEMBL2386363
SMILES Cc1ccc(cc1C#Cc1ccc(CCC(O)=O)c(F)c1)C#N
InChI Key InChIKey=ITBHQTMFISWEAT-UHFFFAOYSA-N
Data  2 EC50
  Tab Delimited (TSV)   2D SDfile   Computed 3D by Vconf -m prep SDfile
Find this compound or compounds like it in BindingDB:
Activity Spreadsheet -- Enzyme Inhibition Constant Data from BindingDB
Found 2 hits for monomerid = 50434304
TargetFree fatty acid receptor 1(Homo sapiens (Human))
University Of Southern Denmark
Curated by ChEMBL
LigandPNGBDBM50434304(CHEMBL2386363)
Affinity DataEC50:  17nM. Assay description: Agonist activity at human FFA1 receptor transfected in human 1321N1 cells by calcium mobilization assay
In DepthDetails ArticlePubMed
TargetFree fatty acid receptor 4(Homo sapiens (Human))
University Of Southern Denmark
Curated by ChEMBL
LigandPNGBDBM50434304(CHEMBL2386363)
Affinity DataEC50:  9.55E+3nM. Assay description: Agonist activity at C-terminal yellow fluorescent protein-fused human FFA4 receptor transfected in HEK293 cells after 5 mins by BRET assay
In DepthDetails ArticlePubMed