BDBM50436264 CHEMBL2398765
SMILES CC(C)[C@@H](NC(=O)c1cccc(c1)-c1ccccc1NC(N)=O)C(=O)N1CC[C@](O)(c2ccc(Cl)cc2)C(C)(C)C1
InChI Key InChIKey=BMFZCZDBDSWUET-ZUKKLESISA-N
Data  2 IC50
  Tab Delimited (TSV)   2D SDfile   Computed 3D by Vconf -m prep SDfile
Find this compound or compounds like it in BindingDB:
Activity Spreadsheet -- Enzyme Inhibition Constant Data from BindingDB
Found 2 hits for monomerid = 50436264
TargetC-C chemokine receptor type 1(Homo sapiens (Human))
Bristol-Myers Squibb
Curated by ChEMBL
LigandPNGBDBM50436264(CHEMBL2398765)
Affinity DataIC50:  3.40nM. Assay description: Binding affinity to human CCR1
In DepthDetails ArticlePubMed
TargetC-C chemokine receptor type 1(Homo sapiens (Human))
Bristol-Myers Squibb
Curated by ChEMBL
LigandPNGBDBM50436264(CHEMBL2398765)
Affinity DataIC50:  48nM. Assay description: Antagonist activity at human CCR1 assessed as inhibition of MIP1alpha-induced chemotaxis
In DepthDetails ArticlePubMed