BDBM50436766 CHEMBL2402575
SMILES CC(C)NC(=O)NS(=O)(=O)c1cc(ccc1Oc1ccc(Cl)cc1)C#N
InChI Key InChIKey=ACKOXVMZLWNATE-UHFFFAOYSA-N
Data  2 IC50
  Tab Delimited (TSV)   2D SDfile   Computed 3D by Vconf -m prep SDfile
Find this compound or compounds like it in BindingDB:
Activity Spreadsheet -- Enzyme Inhibition Constant Data from BindingDB
Found 2 hits for monomerid = 50436766
TargetThromboxane A2 receptor(Homo sapiens (Human))
University Of Liege
Curated by ChEMBL
LigandPNGBDBM50436766(CHEMBL2402575)
Affinity DataIC50:  9.46E+3nM. Assay description: Antagonist activity at human thromboxane A2 receptor alpha over-expressed in HEK293 cells assessed as inhibition of U-46619-induced intracellular cal...
In DepthDetails ArticlePubMed
TargetThromboxane A2 receptor(Homo sapiens (Human))
University Of Liege
Curated by ChEMBL
LigandPNGBDBM50436766(CHEMBL2402575)
Affinity DataIC50:  8.49E+3nM. Assay description: Antagonist activity at human thromboxane A2 receptor beta over-expressed in HEK293 cells assessed as inhibition of U-46619-induced intracellular calc...
In DepthDetails ArticlePubMed