BDBM50437191 CHEMBL2402023
SMILES O[C@@H]1[C@@H]2C[C@@H]2[C@H]([C@@H]1O)n1cnc2c(NCCc3ccc(cc3)S(O)(=O)=O)nc(nc12)C#Cc1ccccc1
InChI Key InChIKey=ODDDHQVHKBFNES-IRYUZJHDSA-N
Data  1 KI
  Tab Delimited (TSV)   2D SDfile   Computed 3D by Vconf -m prep SDfile
Find this compound or compounds like it in BindingDB:
Activity Spreadsheet -- Enzyme Inhibition Constant Data from BindingDB
Found 1 hit for monomerid = 50437191
TargetAdenosine receptor A3(Mus musculus)
National Institute Of Diabetes And Digestive And Kidney Diseases
Curated by ChEMBL
LigandPNGBDBM50437191(CHEMBL2402023)
Affinity DataKi:  3.92E+3nM. Assay description: Displacement of [125I]N6-(4-amino-3-iodobenzyl)adenosine-5'-N-methyluronamide from mouse adenosine A3 receptor expressed in HEK293 cell membranes aft...
In DepthDetails ArticlePubMed