BDBM50437422 CHEMBL2409016
SMILES CCCc1c(cnn1-c1ncc(C)c(n1)-c1cccs1)C(=O)NCc1cc(C)no1
InChI Key InChIKey=GXTJNLVWCUPEAP-UHFFFAOYSA-N
Data  1 EC50
  Tab Delimited (TSV)   2D SDfile   Computed 3D by Vconf -m prep SDfile
Find this compound or compounds like it in BindingDB:
Activity Spreadsheet -- Enzyme Inhibition Constant Data from BindingDB
Found 1 hit for monomerid = 50437422
TargetProbable G-protein coupled receptor 142(Homo sapiens (Human))
Daiichi Sankyo
Curated by ChEMBL
LigandPNGBDBM50437422(CHEMBL2409016)
Affinity DataEC50: >2.00E+4nM. Assay description: Agonist activity at human GPR142 transfected in HEK293 cells after 1 hr by inositol phosphate accumulation assay
In DepthDetails ArticlePubMed