BDBM50440698 CHEMBL2431064
SMILES O=C([C@H](Cc1ccccc1)NCc1cncs1)N1CCn2nc(cc12)-c1ccncc1
InChI Key InChIKey=RRVILQFGAICFPT-NRFANRHFSA-N
Data  1 EC50
  Tab Delimited (TSV)   2D SDfile   Computed 3D by Vconf -m prep SDfile
Find this compound or compounds like it in BindingDB:
Activity Spreadsheet -- Enzyme Inhibition Constant Data from BindingDB
Found 1 hit for monomerid = 50440698
TargetProbable G-protein coupled receptor 142(Homo sapiens (Human))
Amgen
Curated by ChEMBL
LigandPNGBDBM50440698(CHEMBL2431064)
Affinity DataEC50:  2.78E+3nM. Assay description: Agonist activity at human GPR142 expressed in HEK293 cells assessed as inositol phosphate accumulation using [3H]-inositol after 1 hr by scintillatio...
In DepthDetails ArticlePubMed