BDBM50441408 CHEMBL2435938
SMILES FC(F)(F)c1cc(CN(Cc2cnccc2-c2ccccc2)C(=O)c2ccc(Cl)cc2)cc(c1)C(F)(F)F
InChI Key InChIKey=DFSMRUIVPXSXDX-UHFFFAOYSA-N
Data  1 EC50
  Tab Delimited (TSV)   2D SDfile   Computed 3D by Vconf -m prep SDfile
Find this compound or compounds like it in BindingDB:
Activity Spreadsheet -- Enzyme Inhibition Constant Data from BindingDB
Found 1 hit for monomerid = 50441408
TargetG-protein coupled bile acid receptor 1(Homo sapiens (Human))
Chinese Academy Of Sciences
Curated by ChEMBL
LigandPNGBDBM50441408(CHEMBL2435938)
Affinity DataEC50:  7.43E+3nM. Assay description: Agonist activity at human TGR5 expressed in HEK293 cells assessed CRE-induced luciferase activity after 5.5 hrs by reporter gene assay
In DepthDetails ArticlePubMed