BDBM50445022 CHEMBL3098235
SMILES CCCSc1nc(N[C@@H]2C[C@H]2c2scnc2C)c2nnn([C@@H]3C[C@H](OCCO)[C@@H](O)[C@H]3O)c2n1
InChI Key InChIKey=MIKYSHFNQHAARM-IFMAEWBWSA-N
Data  1 IC50
  Tab Delimited (TSV)   2D SDfile   Computed 3D by Vconf -m prep SDfile
Find this compound or compounds like it in BindingDB:
Activity Spreadsheet -- Enzyme Inhibition Constant Data from BindingDB
Found 1 hit for monomerid = 50445022
TargetP2Y purinoceptor 12(Rattus norvegicus)
Shanghai Hengrui Pharmaceutical
Curated by ChEMBL
LigandPNGBDBM50445022(CHEMBL3098235)
Affinity DataIC50:  1.81E+3nM. Assay description: Antagonist activity at P2Y12 receptor in rat platelet-rich plasma assessed as inhibition of ADP-induced platelet aggregation incubated for 5 mins pri...
In DepthDetails ArticlePubMed