BDBM50445380 CHEMBL3104639
SMILES CC(C)[C@H](NC(=O)[C@@H]1CSSC[C@H](NC(=O)[C@H](C)N)C(=O)N[C@@H](Cc2ccccc2)C(=O)N[C@@H](Cc2ccc(I)cc2)C(=O)N[C@@H](CCCCN)C(=O)N[C@@H](Cc2ccc(O)cc2)C(=O)N1)C(O)=O
InChI Key InChIKey=DYSIDVGQAIMCML-ZFCHPTNPSA-N
Data  2 IC50  2 EC50
  Tab Delimited (TSV)   2D SDfile   Computed 3D by Vconf -m prep SDfile
Find this compound or compounds like it in BindingDB:
Activity Spreadsheet -- Enzyme Inhibition Constant Data from BindingDB
Found 4 hits for monomerid = 50445380
TargetUrotensin-2 receptor(RAT)
Universit£
Curated by ChEMBL
LigandPNGBDBM50445380(CHEMBL3104639)
Affinity DataEC50:  89nM. Assay description: Agonist activity at urotensin-2 receptor in Sprague-Dawley rat aortic rings assessed as KCl-induced vasoconstriction
In DepthDetails ArticlePubMed
TargetUrotensin-2 receptor(Homo sapiens (Human))
Universit£
Curated by ChEMBL
LigandPNGBDBM50445380(CHEMBL3104639)
Affinity DataIC50:  58nM. Assay description: Displacement of [125I]-Urotensin-2 from human GPR14 expressed in CHO cells after 90 mins by gamma counting analysis
In DepthDetails ArticlePubMed
TargetUrotensin-2 receptor(RAT)
Universit£
Curated by ChEMBL
LigandPNGBDBM50445380(CHEMBL3104639)
Affinity DataEC50:  89.1nM. Assay description: Agonist activity at urotensin-2 receptor in Sprague-Dawley rat aortic rings assessed as KCl-induced vasoconstriction
In DepthDetails ArticlePubMed
TargetUrotensin-2 receptor(Homo sapiens (Human))
Universit£
Curated by ChEMBL
LigandPNGBDBM50445380(CHEMBL3104639)
Affinity DataIC50:  58nM. Assay description: Displacement of [125I]-Urotensin-2 from human GPR14 expressed in CHO cells after 90 mins by gamma counting analysis
In DepthDetails ArticlePubMed