BDBM50452603 CHEMBL2371213
SMILES [H][C@]1(NC(=O)[C@@H](CCCCN)NC(=O)[C@@H](Cc2c[nH]c3ccccc23)NC(=O)[C@@H](Cc2ccc(N)cc2)NC(=O)[C@@H](CSSC(C)(C)[C@@H](NC1=O)C(=O)N[C@@H]([C@@H](C)O)C(N)=O)NC(=O)[C@@H](N)Cc1ccccc1)[C@@H](C)O
InChI Key InChIKey=AVPMSVQFXPDZBE-VJPJEMQJSA-N
Data  2 IC50
  Tab Delimited (TSV)   2D SDfile   Computed 3D by Vconf -m prep SDfile
Find this compound or compounds like it in BindingDB:
Activity Spreadsheet -- Enzyme Inhibition Constant Data from BindingDB
Found 2 hits for monomerid = 50452603
TargetDelta-type opioid receptor(Rattus norvegicus (rat))
University Of Arizona
Curated by ChEMBL
LigandPNGBDBM50452603(CHEMBL2371213)
Affinity DataIC50: >1.00E+4nM. Assay description: Binding potency of compound in competition with [3H]DPDPE for Opioid receptor delta 1 tested in rat brain membrane
In DepthDetails ArticlePubMed
TargetMu-type opioid receptor(Rattus norvegicus (rat))
University Of Arizona
Curated by ChEMBL
LigandPNGBDBM50452603(CHEMBL2371213)
Affinity DataIC50:  500nM. Assay description: Binding potency of compound in competition with [3H]CTOP for Opioid receptor mu 1 tested in rat brain membrane
In DepthDetails ArticlePubMed