BDBM50453445 CHEMBL2112652
SMILES [H][C@@]12[#6]-[#6]-[#6]-[#7]1-[#6](=O)-[#6@H](-[#6]-[#6]-[#6]\[#7]=[#6](/[#7])-[#7])-[#7]-[#6](=O)[C@@]([H])([#7]-[#6](=O)-[#6@H](-[#6]-[#6]-[#6]\[#7]=[#6](/[#7])-[#7])-[#7]-[#6](=O)-[#6@H](-[#6]-[#6]-[#6]\[#7]=[#6](/[#7])-[#7])-[#7]-[#6](=O)-[#6@H](-[#6]-[#16]-[#6]-[#6]-[#16]-[#6]-[#6@H](-[#7]-[#6]2=O)-[#6](-[#7])=O)-[#7]-[#6](=O)-[#6@H](-[#6]-c1ccccc1)-[#7]-[#6](=O)-[#6]-[#7]-[#6](=O)-[#6]-[#7]-[#6](=O)-[#6@@H](-[#7])-[#6]-c1ccc(-[#8])cc1)[#6@@H](-[#6])-[#6]-[#6]
InChI Key InChIKey=AVKXYIHXPWNSOJ-PHACCDQDSA-N
Data  3 IC50
  Tab Delimited (TSV)   2D SDfile   Computed 3D by Vconf -m prep SDfile
Find this compound or compounds like it in BindingDB:
Activity Spreadsheet -- Enzyme Inhibition Constant Data from BindingDB
Found 3 hits for monomerid = 50453445
TargetKappa-type opioid receptor(Cavia porcellus (domestic guinea pig))
University Of Arizona
Curated by ChEMBL
LigandPNGBDBM50453445(CHEMBL2112652)
Affinity DataIC50:  1nM. Assay description: Binding affinity at kappa opioid receptor in guinea pig brain by [3H]U-69,593 displacement.
In DepthDetails ArticlePubMed
TargetDelta-type opioid receptor(Homo sapiens (Human))
University Of Arizona
Curated by ChEMBL
LigandPNGBDBM50453445(CHEMBL2112652)
Affinity DataIC50:  14nM. Assay description: Binding affinity at delta opioid receptor in guinea pig brain by [3H]c[D-Pen2, p-Cl-Phe4, D-Pen5]-enkephalin displacement.
In DepthDetails ArticlePubMed
TargetMu-type opioid receptor(GUINEA PIG)
University Of Arizona
Curated by ChEMBL
LigandPNGBDBM50453445(CHEMBL2112652)
Affinity DataIC50:  12nM. Assay description: Binding affinity at mu opioid receptor in guinea pig brain by [3H]-DAMGO displacement.
In DepthDetails ArticlePubMed