BDBM53973 2-[3-[(E)-[3-[2-(1-azepanyl)-2-oxoethyl]-2,4-dioxo-5-thiazolidinylidene]methyl]-1-indolyl]acetic acid::2-[3-[(E)-[3-[2-(azepan-1-yl)-2-keto-ethyl]-2,4-diketo-thiazolidin-5-ylidene]methyl]indol-1-yl]acetic acid::2-[3-[(E)-[3-[2-(azepan-1-yl)-2-oxidanylidene-ethyl]-2,4-bis(oxidanylidene)-1,3-thiazolidin-5-ylidene]methyl]indol-1-yl]ethanoic acid::2-[3-[(E)-[3-[2-(azepan-1-yl)-2-oxoethyl]-2,4-dioxo-1,3-thiazolidin-5-ylidene]methyl]indol-1-yl]acetic acid::MLS000716686::SMR000278203::cid_5769715
SMILES OC(=O)Cn1cc(\C=C2\SC(=O)N(CC(=O)N3CCCCCC3)C2=O)c2ccccc12
InChI Key InChIKey=XEZUEAOOCKGULG-WOJGMQOQSA-N
Data  1 IC50  1 EC50
  Tab Delimited (TSV)   2D SDfile   Computed 3D by Vconf -m prep SDfile
Find this compound or compounds like it in BindingDB:
Activity Spreadsheet -- Enzyme Inhibition Constant Data from BindingDB
Found 2 hits for monomerid = 53973
TargetImportin subunit alpha-1(Homo sapiens (Human))
Broad Institute
Curated by PubChem BioAssay
LigandPNGBDBM53973(2-[3-[(E)-[3-[2-(1-azepanyl)-2-oxoethyl]-2,4-dioxo...)
Affinity DataEC50: >5.00E+5nM. Assay description: Keywords: Counterscreen, FRET assay, HTS, YIC probe, Dose response, Assay Overview: This is a fluorescence resonance energy transfer (FRET)-based b...
In DepthDetails PCBioAssay
TargetM1 family aminopeptidase(Plasmodium falciparum (isolate FcB1 / Columbia))
Srmlsc
Curated by PubChem BioAssay
LigandPNGBDBM53973(2-[3-[(E)-[3-[2-(1-azepanyl)-2-oxoethyl]-2,4-dioxo...)
Affinity DataIC50:  8.23E+4nM. Assay description: Southern Research Molecular Libraries Screening Center (SRMLSC) Southern Research Institute (Birmingham, Alabama) NIH Molecular Libraries Screening...
In DepthDetails PCBioAssay