BDBM58732 2-[(1-methylpyrazole-3-carbonyl)amino]-5,6-dihydro-4H-cyclopenta[b]thiophene-3-carboxylic acid methyl ester::2-[[(1-methyl-3-pyrazolyl)-oxomethyl]amino]-5,6-dihydro-4H-cyclopenta[b]thiophene-3-carboxylic acid methyl ester::MLS001240125::SMR000673293::cid_4668907::methyl 2-[(1-methylpyrazol-3-yl)carbonylamino]-5,6-dihydro-4H-cyclopenta[b]thiophene-3-carboxylate::methyl 2-[(1-methylpyrazole-3-carbonyl)amino]-5,6-dihydro-4H-cyclopenta[b]thiophene-3-carboxylate::methyl 2-{[(1-methyl-1H-pyrazol-3-yl)carbonyl]amino}-5,6-dihydro-4H-cyclopenta[b]thiophene-3-carboxylate
SMILES COC(=O)c1c(NC(=O)c2ccn(C)n2)sc2CCCc12
InChI Key InChIKey=WAUTZUVLOJRFQS-UHFFFAOYSA-N
Data  1 EC50
  Tab Delimited (TSV)   2D SDfile   Computed 3D by Vconf -m prep SDfile
Find this compound or compounds like it in BindingDB:
Activity Spreadsheet -- Enzyme Inhibition Constant Data from BindingDB
Found 1 hit for monomerid = 58732
TargetStreptokinase A(Streptococcus pyogenes M1 GAS)
Broad Institute
Curated by PubChem BioAssay
LigandPNGBDBM58732(2-[(1-methylpyrazole-3-carbonyl)amino]-5,6-dihydro...)
Affinity DataEC50:  1.50E+5nM. Assay description: Keywords: Group A streptococcus, GAS, streptokinase, expression, virulence, inhibition, dose response, EC50 Assay Overview: The goal of this assa...
In DepthDetails PCBioAssay