BDBM67251 2-(4-methyl-3-nitrophenyl)-2-oxoethyl isonicotinate::4-pyridinecarboxylic acid [2-(4-methyl-3-nitrophenyl)-2-oxoethyl] ester::MLS000681503::SMR000269167::[2-(4-methyl-3-nitro-phenyl)-2-oxidanylidene-ethyl] pyridine-4-carboxylate::[2-(4-methyl-3-nitrophenyl)-2-oxoethyl] pyridine-4-carboxylate::cid_761850::isonicotinic acid [2-keto-2-(4-methyl-3-nitro-phenyl)ethyl] ester
SMILES Cc1ccc(cc1[N+]([O-])=O)C(=O)COC(=O)c1ccncc1
InChI Key InChIKey=CLAPWGYQMWTPNJ-UHFFFAOYSA-N
Data  2 IC50
  Tab Delimited (TSV)   2D SDfile   Computed 3D by Vconf -m prep SDfile
Find this compound or compounds like it in BindingDB:
Activity Spreadsheet -- Enzyme Inhibition Constant Data from BindingDB
Found 2 hits for monomerid = 67251
TargetType-1 angiotensin II receptor(Homo sapiens (Human))
Burnham Center For Chemical Genomics
Curated by PubChem BioAssay
LigandPNGBDBM67251(2-(4-methyl-3-nitrophenyl)-2-oxoethyl isonicotinat...)
Affinity DataIC50:  2.00E+4nM. Assay description: Data Source: Sanford-Burnham Center for Chemical Genomics (SBCCG) Source Affiliation: Sanford-Burnham Medical Research Institute(SBMRI, San Diego, C...
In DepthDetails PCBioAssay
TargetApelin receptor(Homo sapiens (Human))
Sanford-Burnham Center For Chemical Genomics
Curated by PubChem BioAssay
LigandPNGBDBM67251(2-(4-methyl-3-nitrophenyl)-2-oxoethyl isonicotinat...)
Affinity DataIC50: >4.00E+4nM. Assay description: Data Source: Sanford-Burnham Center for Chemical Genomics (SBCCG) Source Affiliation: Sanford- Sanford-Burnham Medical Research Institute(SBMRI, San...
In DepthDetails PCBioAssay