BDBM67286 1-(3,4-dichlorophenyl)-2-(3-methyl-1-piperidinyl)ethanone::1-(3,4-dichlorophenyl)-2-(3-methylpiperidin-1-yl)ethanone::1-(3,4-dichlorophenyl)-2-(3-methylpiperidino)ethanone::MLS001033014::SMR000363518::cid_5218417
SMILES CC1CCCN(CC(=O)c2ccc(Cl)c(Cl)c2)C1
InChI Key InChIKey=APIRRWANGJCETR-UHFFFAOYSA-N
Data  2 IC50  1 EC50
  Tab Delimited (TSV)   2D SDfile   Computed 3D by Vconf -m prep SDfile
Find this compound or compounds like it in BindingDB:
Activity Spreadsheet -- Enzyme Inhibition Constant Data from BindingDB
Found 3 hits for monomerid = 67286
TargetApelin receptor(Homo sapiens (Human))
Sanford-Burnham Center For Chemical Genomics
Curated by PubChem BioAssay
LigandPNGBDBM67286(1-(3,4-dichlorophenyl)-2-(3-methyl-1-piperidinyl)e...)
Affinity DataIC50:  4.79E+3nM. Assay description: Data Source: Sanford-Burnham Center for Chemical Genomics (SBCCG) Source Affiliation: Sanford- Sanford-Burnham Medical Research Institute(SBMRI, San...
In DepthDetails PCBioAssay
TargetBeta-galactosidase(Escherichia coli)
Burnham Center For Chemical Genomics
Curated by PubChem BioAssay
LigandPNGBDBM67286(1-(3,4-dichlorophenyl)-2-(3-methyl-1-piperidinyl)e...)
Affinity DataEC50:  3.08E+4nM. Assay description: Data Source: Sanford-Burnham Center for Chemical Genomics (SBCCG) Source Affiliation: Sanford-Burnham Medical Research Institute(SBMRI, San Diego, C...
In DepthDetails PCBioAssay
TargetType-1 angiotensin II receptor(Homo sapiens (Human))
Burnham Center For Chemical Genomics
Curated by PubChem BioAssay
LigandPNGBDBM67286(1-(3,4-dichlorophenyl)-2-(3-methyl-1-piperidinyl)e...)
Affinity DataIC50:  4.76E+3nM. Assay description: Data Source: Sanford-Burnham Center for Chemical Genomics (SBCCG) Source Affiliation: Sanford-Burnham Medical Research Institute(SBMRI, San Diego, C...
In DepthDetails PCBioAssay