BDBM68066 1-(4-fluorophenyl)-N-[2-hydroxy-5-[(4-methoxyphenyl)sulfamoyl]phenyl]-3-methyl-5-thieno[2,3-c]pyrazolecarboxamide::1-(4-fluorophenyl)-N-[2-hydroxy-5-[(4-methoxyphenyl)sulfamoyl]phenyl]-3-methyl-thieno[2,3-c]pyrazole-5-carboxamide::1-(4-fluorophenyl)-N-[2-hydroxy-5-[(4-methoxyphenyl)sulfamoyl]phenyl]-3-methylthieno[2,3-c]pyrazole-5-carboxamide::1-(4-fluorophenyl)-N-[5-[(4-methoxyphenyl)sulfamoyl]-2-oxidanyl-phenyl]-3-methyl-thieno[2,3-c]pyrazole-5-carboxamide::MLS000401592::SMR000243497::cid_3690550
SMILES COc1ccc(NS(=O)(=O)c2ccc(O)c(NC(=O)c3cc4c(C)nn(-c5ccc(F)cc5)c4s3)c2)cc1
InChI Key InChIKey=AIXCLGQVXMIORW-UHFFFAOYSA-N
Data  4 IC50  2 EC50
  Tab Delimited (TSV)   2D SDfile   Computed 3D by Vconf -m prep SDfile
Find this compound or compounds like it in BindingDB:
Activity Spreadsheet -- Enzyme Inhibition Constant Data from BindingDB
Found 6 hits for monomerid = 68066
TargetDNA damage-inducible transcript 3 protein(Mus musculus)
Emory University
Curated by PubChem BioAssay
LigandPNGBDBM68066(1-(4-fluorophenyl)-N-[2-hydroxy-5-[(4-methoxypheny...)
Affinity DataIC50:  6.64E+3nM. Assay description: NIH Molecular Libraries Screening Centers Network [MLSCN] Emory Chemical Biology Discovery Center in MLSCN Assay provider: Dr. Randal Kaufman, Univer...
In DepthDetails PCBioAssay
TargetX-box-binding protein 1(Homo sapiens (Human))
Emory University
Curated by PubChem BioAssay
LigandPNGBDBM68066(1-(4-fluorophenyl)-N-[2-hydroxy-5-[(4-methoxypheny...)
Affinity DataIC50:  1.00E+4nM. Assay description: NIH Molecular Libraries Screening Centers Network [MLSCN] Emory Chemical Biology Discovery Center in MLSCN Assay provider: Dr. Randal Kaufman, Univer...
In DepthDetails PCBioAssay
TargetDNA (cytosine-5)-methyltransferase 1(Homo sapiens (Human))
Burnham Center For Chemical Genomics
Curated by PubChem BioAssay
LigandPNGBDBM68066(1-(4-fluorophenyl)-N-[2-hydroxy-5-[(4-methoxypheny...)
Affinity DataIC50:  6.92E+3nM. Assay description: Data Source: Sanford-Burnham Center for Chemical Genomics (SBCCG) Source Affiliation: Sanford-Burnham Medical Research Institute (SBMRI, San Diego, C...
In DepthDetails PCBioAssay
TargetDelta-type opioid receptor(Homo sapiens (Human))
The Scripps Research Institute Molecular Screening Center
Curated by PubChem BioAssay
LigandPNGBDBM68066(1-(4-fluorophenyl)-N-[2-hydroxy-5-[(4-methoxypheny...)
Affinity DataEC50: >9.25E+4nM. Assay description: Source (MLPCN Center Name): The Scripps Research Institute Molecular Screening Center (SRIMSC) Affiliation: The Scripps Research Institute, TSRI Assa...
In DepthDetails PCBioAssay
TargetCorticotropin-releasing factor-binding protein(Homo sapiens (Human))
Burnham Center For Chemical Genomics
Curated by PubChem BioAssay
LigandPNGBDBM68066(1-(4-fluorophenyl)-N-[2-hydroxy-5-[(4-methoxypheny...)
Affinity DataEC50: >5.30E+4nM. Assay description: Data Source: Sanford-Burnham Center for Chemical Genomics (SBCCG) Source Affiliation: Sanford-Burnham Medical Research Institute (SBMRI, San Diego, C...
In DepthDetails PCBioAssay
TargetDNA damage-inducible transcript 3 protein(Mus musculus)
Emory University
Curated by PubChem BioAssay
LigandPNGBDBM68066(1-(4-fluorophenyl)-N-[2-hydroxy-5-[(4-methoxypheny...)
Affinity DataIC50:  6.64E+3nM. Assay description: NIH Molecular Libraries Screening Centers Network [MLSCN] Emory Chemical Biology Discovery Center in MLSCN Assay provider: Dr. Randal Kaufman, Univer...
In DepthDetails PCBioAssay