BDBM70975 US9546164, 130::US9694002, 130
SMILES CC1(COc2cc(F)c(cc2C2CC2)C(=O)NS(C)(=O)=O)CCN(Cc2ccc(F)cc2C(F)(F)F)CC1
InChI Key InChIKey=OHBBONZPZRTSGV-UHFFFAOYSA-N
Data  2 IC50
  Tab Delimited (TSV)   2D SDfile   Computed 3D by Vconf -m prep SDfile
Find this compound or compounds like it in BindingDB:
Activity Spreadsheet -- Enzyme Inhibition Constant Data from BindingDB
Found 2 hits for monomerid = 70975
TargetSodium channel protein type 5 subunit alpha(Homo sapiens (Human))
Genentech
US Patent
LigandPNGBDBM70975(US9546164, 130 | US9694002, 130)
Affinity DataIC50:  3.5nMpH: 7.4 T: 2°C. Assay description: Radioligand Binding Studies: Saturation experiments. A representative compound of formula (I) having a methyl group was tritiated. Three tritiums wer...
Ligand InfoPC cidPC sid
In DepthDetails US Patent
TargetSodium channel protein type 1/10/11/2/3/4/5/8/9 subunit alpha(Homo sapiens (Human))
Genentech
US Patent
LigandPNGBDBM70975(US9546164, 130 | US9694002, 130)
Affinity DataIC50:  3.5nMpH: 7.4 T: 2°C. Assay description: Binding of this radioligand was preformed in 5 mL borosilicate glass test tubes at room temperature. Binding was initiated by adding membranes to inc...
Ligand InfoPC cidPC sid
In DepthDetails US Patent