BDBM76105 2-(5-{[2-(sec-butylamino)-2-oxoethyl]thio}-3-oxo-2,3-dihydroimidazo[1,2-c]quinazolin-2-yl)-N-(4-fluorobenzyl)acetamide::2-[5-[2-(butan-2-ylamino)-2-oxidanylidene-ethyl]sulfanyl-3-oxidanylidene-2H-imidazo[1,2-c]quinazolin-2-yl]-N-[(4-fluorophenyl)methyl]ethanamide::2-[5-[2-(butan-2-ylamino)-2-oxoethyl]sulfanyl-3-oxo-2H-imidazo[1,2-c]quinazolin-2-yl]-N-[(4-fluorophenyl)methyl]acetamide::2-[5-[[2-(butan-2-ylamino)-2-oxoethyl]thio]-3-oxo-2H-imidazo[1,2-c]quinazolin-2-yl]-N-[(4-fluorophenyl)methyl]acetamide::MLS000094900::N-(4-fluorobenzyl)-2-[3-keto-5-[[2-keto-2-(sec-butylamino)ethyl]thio]-2H-imidazo[1,2-c]quinazolin-2-yl]acetamide::SMR000030453::cid_3245101
SMILES CCC(C)NC(=O)CSC1=Nc2ccccc2C2=NC(CC(=O)NCc3ccc(F)cc3)C(=O)N12
InChI Key InChIKey=BFCBHWDZHDMAAB-UHFFFAOYSA-N
Data  2 EC50
  Tab Delimited (TSV)   2D SDfile   Computed 3D by Vconf -m prep SDfile
Find this compound or compounds like it in BindingDB:
Activity Spreadsheet -- Enzyme Inhibition Constant Data from BindingDB
Found 2 hits for monomerid = 76105
TargetApelin receptor(Homo sapiens (Human))
Burnham Center For Chemical Genomics
Curated by PubChem BioAssay
LigandPNGBDBM76105(2-(5-{[2-(sec-butylamino)-2-oxoethyl]thio}-3-oxo-2...)
Affinity DataEC50: >1.00E+5nM. Assay description: Data Source: Sanford-Burnham Center for Chemical Genomics (SBCCG) Source Affiliation: Sanford-Burnham Medical Research Institute(SBMRI, San Diego) Ne...
In DepthDetails PCBioAssay
TargetType-1 angiotensin II receptor(Homo sapiens (Human))
Burnham Center For Chemical Genomics
Curated by PubChem BioAssay
LigandPNGBDBM76105(2-(5-{[2-(sec-butylamino)-2-oxoethyl]thio}-3-oxo-2...)
Affinity DataEC50: >1.00E+5nM. Assay description: Data Source: Sanford-Burnham Center for Chemical Genomics (SBCCG) Source Affiliation: Sanford-Burnham Medical Research Institute(SBMRI, San Diego) Ne...
In DepthDetails PCBioAssay