BDBM79212 (2R,3R)-2-(diphenylmethyl)-N-[(2-iodanylphenyl)methyl]-1-azabicyclo[2.2.2]octan-3-amine;ethanedioic acid;hydrate::(2R,3R)-2-(diphenylmethyl)-N-[(2-iodophenyl)methyl]-1-azabicyclo[2.2.2]octan-3-amine;oxalic acid;hydrate::(2R,3R)-2-benzhydryl-N-[(2-iodophenyl)methyl]-1-azabicyclo[2.2.2]octan-3-amine;oxalic acid;hydrate::L-703,606 oxalate salt hydrate::MLS002172464::SMR001254095::[(2R,3R)-2-benzhydrylquinuclidin-3-yl]-(2-iodobenzyl)amine;oxalic acid;hydrate::cid_25102597
SMILES [H]C12CCN(CC1)[C@H](C(c1ccccc1)c1ccccc1)[C@@H]2NCc1ccccc1I
InChI Key InChIKey=WSLTYZVXORBNLB-KAYWLYCHSA-N
Data  2 IC50
  Tab Delimited (TSV)   2D SDfile   Computed 3D by Vconf -m prep SDfile
Find this compound or compounds like it in BindingDB:
Activity Spreadsheet -- Enzyme Inhibition Constant Data from BindingDB
Found 2 hits for monomerid = 79212
TargetPotassium channel subfamily K member 9(Homo sapiens (Human))
Universidad De Talca
Curated by ChEMBL
LigandPNGBDBM79212((2R,3R)-2-(diphenylmethyl)-N-[(2-iodanylphenyl)met...)
Affinity DataIC50:  4.55E+4nM. Assay description: Inhibition of human TASK3 expressed in HEK293 cells by Ti+ flux assay
In DepthDetails ArticlePubMed
TargetUbiquitin-conjugating enzyme E2 N(Homo sapiens (Human))
Burnham Center For Chemical Genomics
Curated by PubChem BioAssay
LigandPNGBDBM79212((2R,3R)-2-(diphenylmethyl)-N-[(2-iodanylphenyl)met...)
Affinity DataIC50: >2.00E+4nM. Assay description: Data Source: Sanford-Burnham Center for Chemical Genomics (SBCCG) Source Affiliation: Sanford-Burnham Medical Research Institute (SBMRI, San Diego CA...
In DepthDetails PCBioAssay