BDBM79595 (2-oxidanylideneoxolan-3-yl) 2-(3,4-dipropoxyphenyl)carbonylbenzoate::(2-oxooxolan-3-yl) 2-(3,4-dipropoxybenzoyl)benzoate::2-(3,4-dipropoxybenzoyl)benzoic acid (2-ketotetrahydrofuran-3-yl) ester::2-[(3,4-dipropoxyphenyl)-oxomethyl]benzoic acid (2-oxo-3-oxolanyl) ester::MLS002166510::SMR001248858::cid_5024835
SMILES CCCOc1ccc(cc1OCCC)C(=O)c1ccccc1C(=O)OC1CCOC1=O
InChI Key InChIKey=APUOHHVGNOQUIR-UHFFFAOYSA-N
Data  1 EC50
  Tab Delimited (TSV)   2D SDfile   Computed 3D by Vconf -m prep SDfile
Find this compound or compounds like it in BindingDB:
Activity Spreadsheet -- Enzyme Inhibition Constant Data from BindingDB
Found 1 hit for monomerid = 79595
TargetNeurotensin receptor type 1(Homo sapiens (Human))
Burnham Center For Chemical Genomics
Curated by PubChem BioAssay
LigandPNGBDBM79595((2-oxidanylideneoxolan-3-yl) 2-(3,4-dipropoxypheny...)
Affinity DataEC50:  1.98E+4nM. Assay description: Data Source: Sanford-Burnham Center for Chemical Genomics (SBCCG) Source Affiliation: Sanford-Burnham Medical Research Institute (SBMRI, San Diego, C...
In DepthDetails PCBioAssay