BDBM80058 2-chloranyl-3-(2-phenylethylamino)naphthalene-1,4-dione::2-chloro-3-(2-phenylethylamino)naphthalene-1,4-dione::2-chloro-3-(phenethylamino)-1,4-naphthoquinone::MLS002608293::SMR001527044::cid_237490
SMILES Oc1c(Cl)c(N=CCc2ccccc2)c(O)c2ccccc12
InChI Key InChIKey=CXPKKSMRVXUFNA-UHFFFAOYSA-N
Data  6 IC50
  Tab Delimited (TSV)   2D SDfile   Computed 3D by Vconf -m prep SDfile
Find this compound or compounds like it in BindingDB:
Activity Spreadsheet -- Enzyme Inhibition Constant Data from BindingDB
Found 6 hits for monomerid = 80058
TargetBeta-galactosidase(Escherichia coli)
Burnham Center For Chemical Genomics
Curated by PubChem BioAssay
LigandPNGBDBM80058(2-chloranyl-3-(2-phenylethylamino)naphthalene-1,4-...)
Affinity DataIC50: >6.66E+4nM. Assay description: Data Source: Sanford-Burnham Center for Chemical Genomics (SBCCG) Source Affiliation: Sanford-Burnham Medical Research Institute(SBMRI, San Diego, C...
In DepthDetails PCBioAssay
TargetHexokinase HKDC1 [W721R](Homo sapiens (Human))
Burnham Center For Chemical Genomics
Curated by PubChem BioAssay
LigandPNGBDBM80058(2-chloranyl-3-(2-phenylethylamino)naphthalene-1,4-...)
Affinity DataIC50:  7.92E+3nM. Assay description: Data Source: Sanford-Burnham Center for Chemical Genomics (SBCCG) Source Affiliation: Sanford-Burnham Medical Research Institute (SBMRI, San Diego, C...
In DepthDetails PCBioAssay
TargetToll-like receptor 9(Homo sapiens (Human))
The Scripps Research Institute Molecular Screening Center
Curated by PubChem BioAssay
LigandPNGBDBM80058(2-chloranyl-3-(2-phenylethylamino)naphthalene-1,4-...)
Affinity DataIC50:  5.79E+3nM. Assay description: Source (MLPCN Center Name): The Scripps Research Institute Molecular Screening Center (SRIMSC) Affiliation: The Scripps Research Institute, TSRI Assa...
In DepthDetails PCBioAssay
TargetHexokinase HKDC1 [W721R](Homo sapiens (Human))
Burnham Center For Chemical Genomics
Curated by PubChem BioAssay
LigandPNGBDBM80058(2-chloranyl-3-(2-phenylethylamino)naphthalene-1,4-...)
Affinity DataIC50:  1.85E+4nM. Assay description: Data Source: Sanford-Burnham Center for Chemical Genomics (SBCCG) Source Affiliation: Sanford-Burnham Medical Research Institute (SBMRI, San Diego, C...
In DepthDetails PCBioAssay
TargetBeta-lactamase(Pseudomonas aeruginosa)
The Scripps Research Institute Molecular Screening Center
Curated by PubChem BioAssay
LigandPNGBDBM80058(2-chloranyl-3-(2-phenylethylamino)naphthalene-1,4-...)
Affinity DataIC50:  1.77E+4nM. Assay description: Source (MLPCN Center Name): The Scripps Research Institute Molecular Screening Center (SRIMSC) Affiliation: The Scripps Research Institute, TSRI Assa...
In DepthDetails PCBioAssay
TargetC-C chemokine receptor type 6(Homo sapiens (Human))
Burnham Center For Chemical Genomics
Curated by PubChem BioAssay
LigandPNGBDBM80058(2-chloranyl-3-(2-phenylethylamino)naphthalene-1,4-...)
Affinity DataIC50:  2.22E+4nM. Assay description: Data Source: Sanford-Burnham Center for Chemical Genomics (SBCCG) Source Affiliation: Sanford-Burnham Medical Research Institute(SBMRI, San Diego, CA...
In DepthDetails PCBioAssay