BDBM83658 4-keto-N-[2-keto-2-(p-phenetidino)ethyl]-3-(4-methoxyphenyl)phthalazine-1-carboxamide::MLS000936628::N-[2-(4-ethoxyanilino)-2-oxoethyl]-3-(4-methoxyphenyl)-4-oxo-1-phthalazinecarboxamide::N-[2-(4-ethoxyanilino)-2-oxoethyl]-3-(4-methoxyphenyl)-4-oxophthalazine-1-carboxamide::N-[2-[(4-ethoxyphenyl)amino]-2-oxidanylidene-ethyl]-3-(4-methoxyphenyl)-4-oxidanylidene-phthalazine-1-carboxamide::SMR000621090::cid_5073297
SMILES CCOc1ccc(NC(=O)CNC(=O)c2nn(-c3ccc(OC)cc3)c(=O)c3ccccc23)cc1
InChI Key InChIKey=QFBVIXDNWBWLKT-UHFFFAOYSA-N
Data  2 EC50
  Tab Delimited (TSV)   2D SDfile   Computed 3D by Vconf -m prep SDfile
Find this compound or compounds like it in BindingDB:
Activity Spreadsheet -- Enzyme Inhibition Constant Data from BindingDB
Found 2 hits for monomerid = 83658
TargetEndoribonuclease toxin MazF(Escherichia coli str. K-12 substr. MG1655)
Burnham Center For Chemical Genomics
Curated by PubChem BioAssay
LigandPNGBDBM83658(4-keto-N-[2-keto-2-(p-phenetidino)ethyl]-3-(4-meth...)
Affinity DataEC50:  4.82E+4nM. Assay description: Data Source: Sanford-Burnham Center for Chemical Genomics (SBCCG) Source Affiliation: Sanford-Burnham Medical Research Institute (SBMRI, San Diego, C...
In DepthDetails PCBioAssay
TargetEndoribonuclease toxin MazF(Escherichia coli str. K-12 substr. MG1655)
Burnham Center For Chemical Genomics
Curated by PubChem BioAssay
LigandPNGBDBM83658(4-keto-N-[2-keto-2-(p-phenetidino)ethyl]-3-(4-meth...)
Affinity DataEC50: >9.90E+4nM. Assay description: Data Source: Sanford-Burnham Center for Chemical Genomics (SBCCG) Source Affiliation: Sanford-Burnham Medical Research Institute (SBMRI, San Diego, C...
In DepthDetails PCBioAssay