BDBM86273 MCL-211
SMILES CN1CCc2c(cc(O)c(O)c2Br)[C@@H](C1)c1cccc(c1)C(F)(F)F
InChI Key InChIKey=FTKZFGGKMRGKQD-AWEZNQCLSA-N
Data  5 KI
  Tab Delimited (TSV)   2D SDfile   Computed 3D by Vconf -m prep SDfile
Find this compound or compounds like it in BindingDB:
Activity Spreadsheet -- Enzyme Inhibition Constant Data from BindingDB
Found 5 hits for monomerid = 86273
TargetD(1A) dopamine receptor(RAT)
Harvard University
Curated by PDSP Ki Database
LigandPNGBDBM86273(MCL-211)
Affinity DataKi:  8.66nM
In DepthDetails ArticlePubMed
Target5-hydroxytryptamine receptor 2A(Rattus norvegicus (rat))
Harvard University
Curated by PDSP Ki Database
LigandPNGBDBM86273(MCL-211)
Affinity DataKi:  68.9nM
In DepthDetails ArticlePubMed
TargetD(3) dopamine receptor(Homo sapiens (Human))
Harvard University
Curated by PDSP Ki Database
LigandPNGBDBM86273(MCL-211)
Affinity DataKi:  356nM
In DepthDetails ArticlePubMed
TargetAlpha-2C adrenergic receptor(RAT)
Harvard University
Curated by PDSP Ki Database
LigandPNGBDBM86273(MCL-211)
Affinity DataKi:  365nM
In DepthDetails ArticlePubMed
TargetD(2) dopamine receptor(Rattus norvegicus (rat))
Harvard University
Curated by PDSP Ki Database
LigandPNGBDBM86273(MCL-211)
Affinity DataKi:  1.05E+3nM
In DepthDetails ArticlePubMed