BDBM86274 MCL-218
SMILES Oc1cc2[C@@H](CNCCc2c(Br)c1O)c1cccc(c1)C(F)(F)F
InChI Key InChIKey=JXTPLVZCJWMJQJ-ZDUSSCGKSA-N
Data  5 KI
  Tab Delimited (TSV)   2D SDfile   Computed 3D by Vconf -m prep SDfile
Find this compound or compounds like it in BindingDB:
Activity Spreadsheet -- Enzyme Inhibition Constant Data from BindingDB
Found 5 hits for monomerid = 86274
TargetAlpha-2C adrenergic receptor(RAT)
Harvard University
Curated by PDSP Ki Database
LigandPNGBDBM86274(MCL-218)
Affinity DataKi:  776nM
In DepthDetails ArticlePubMed
Target5-hydroxytryptamine receptor 2A(Rattus norvegicus (rat))
Harvard University
Curated by PDSP Ki Database
LigandPNGBDBM86274(MCL-218)
Affinity DataKi:  992nM
In DepthDetails ArticlePubMed
TargetD(1A) dopamine receptor(RAT)
Harvard University
Curated by PDSP Ki Database
LigandPNGBDBM86274(MCL-218)
Affinity DataKi:  1.24E+3nM
In DepthDetails ArticlePubMed
TargetD(2) dopamine receptor(Rattus norvegicus (rat))
Harvard University
Curated by PDSP Ki Database
LigandPNGBDBM86274(MCL-218)
Affinity DataKi: >1.00E+4nM
In DepthDetails ArticlePubMed
TargetD(3) dopamine receptor(Homo sapiens (Human))
Harvard University
Curated by PDSP Ki Database
LigandPNGBDBM86274(MCL-218)
Affinity DataKi: >1.00E+4nM
In DepthDetails ArticlePubMed