BDBM86868 CAS_3643794::N-(5-(4-bromobenzylthio)-1,3,4-thiadiazol-2-yl)-4-fluorobenzamide::NSC_3643794
SMILES Fc1ccc(cc1)C(=O)Nc1nnc(SCc2ccc(Br)cc2)s1
InChI Key InChIKey=UEVPEEHDLTWCMS-UHFFFAOYSA-N
Data  2 KI
  Tab Delimited (TSV)   2D SDfile   Computed 3D by Vconf -m prep SDfile
Find this compound or compounds like it in BindingDB:
Activity Spreadsheet -- Enzyme Inhibition Constant Data from BindingDB
Found 2 hits for monomerid = 86868
TargetTyrosine-protein kinase ABL1(Homo sapiens (Human))
Universit&Aagrov
Curated by PDSP Ki Database
LigandPNGBDBM86868(CAS_3643794 | N-(5-(4-bromobenzylthio)-1,3,4-thiad...)
Affinity DataKi:  89nM
In DepthDetails ArticlePubMed
TargetProto-oncogene tyrosine-protein kinase Src(Homo sapiens (Human))
Universit&Aagrov
Curated by PDSP Ki Database
LigandPNGBDBM86868(CAS_3643794 | N-(5-(4-bromobenzylthio)-1,3,4-thiad...)
Affinity DataKi:  221nM
In DepthDetails ArticlePubMed