BDBM87118 2-(2-chloro-6-fluoro-benzyl)-N-isopropyl-1,5-diketo-4-propyl-[1,2,4]triazolo[4,3-a]quinazoline-8-carboxamide::2-[(2-chloranyl-6-fluoranyl-phenyl)methyl]-1,5-bis(oxidanylidene)-N-propan-2-yl-4-propyl-[1,2,4]triazolo[4,3-a]quinazoline-8-carboxamide::2-[(2-chloro-6-fluorophenyl)methyl]-1,5-dioxo-N-propan-2-yl-4-propyl-[1,2,4]triazolo[4,3-a]quinazoline-8-carboxamide::MLS-0463497.0001::cid_44117475
SMILES CCCn1c2nn(Cc3c(F)cccc3Cl)c(=O)n2c2cc(ccc2c1=O)C(=O)NC(C)C
InChI Key InChIKey=UICUYQWJFQEBAP-UHFFFAOYSA-N
Data  1 IC50
  Tab Delimited (TSV)   2D SDfile   Computed 3D by Vconf -m prep SDfile
Find this compound or compounds like it in BindingDB:
Activity Spreadsheet -- Enzyme Inhibition Constant Data from BindingDB
Found 1 hit for monomerid = 87118
TargetDNA dC->dU-editing enzyme APOBEC-3G(Homo sapiens (Human))
Burnham Center For Chemical Genomics
Curated by PubChem BioAssay
LigandPNGBDBM87118(2-(2-chloro-6-fluoro-benzyl)-N-isopropyl-1,5-diket...)
Affinity DataIC50: >9.90E+4nMT: 2°C. Assay description: Data Source: Sanford-Burnham Center for Chemical Genomics (SBCCG) Source Affiliation: Sanford-Burnham Medical Research Institute (SBMRI, San Diego, C...
In DepthDetails PCBioAssay